running 1 test test eight_jobs_and_ninth_refusal_preserve_real_leases_and_loss_counts ... FAILED failures: ---- eight_jobs_and_ninth_refusal_preserve_real_leases_and_loss_counts stdout ---- thread 'eight_jobs_and_ninth_refusal_preserve_real_leases_and_loss_counts' (41613158) panicked at tests/deferred_work.rs:387:5: assertion `left == right` failed left: 1 right: 3 note: run with `RUST_BACKTRACE=1` environment variable to display a backtrace failures: eight_jobs_and_ninth_refusal_preserve_real_leases_and_loss_counts test result: FAILED. 0 passed; 1 failed; 0 ignored; 0 measured; 27 filtered out; finished in 0.00s Compiling turkos-os-deferred-work v0.1.0 (/reports/os-implementation/K981-K999-preparation-0bsVMr/mutant-wrong-loss-multiplicity/os-deferred-work) Finished `test` profile [unoptimized + debuginfo] target(s) in 0.51s Running tests/deferred_work.rs (reports/os-implementation/K981-K999-preparation-0bsVMr/mutant-wrong-loss-multiplicity/target/debug/build/turkos-os-deferred-work/bfb4bf5e81b06a44/out/deferred_work-bfb4bf5e81b06a44) error: test failed, to rerun pass `--test deferred_work`