running 1 test test os_shared_memory_seal_negative ... FAILED failures: failures: os_shared_memory_seal_negative test result: FAILED. 0 passed; 1 failed; 0 ignored; 0 measured; 2 filtered out; finished in 0.00s thread 'os_shared_memory_seal_negative' (48716565) panicked at /reports/os-implementation/K1370-shared-memory-seal-local-preflight-RtF1Cl/workspace/kernel/tests/os/shared_memory_seal.rs:44:5: assertion `left == right` failed left: Ok((8192, ReadWrite)) right: Err(Access) note: run with `RUST_BACKTRACE=1` environment variable to display a backtrace