running 2 tests test os_vfs_paths_mount_cross_positive ... ok test os_vfs_paths_mount_cross_negative ... FAILED failures: ---- os_vfs_paths_mount_cross_negative stdout ---- thread 'os_vfs_paths_mount_cross_negative' (49907166) panicked at /reports/os-implementation/K1550-vfs-mount-cross-local-O3IFqi/mutant/kernel/tests/os/vfs_mount_cross.rs:40:5: assertion `left == right` failed left: Err(NoMount) right: Err(AboveRoot) note: run with `RUST_BACKTRACE=1` environment variable to display a backtrace failures: os_vfs_paths_mount_cross_negative test result: FAILED. 1 passed; 1 failed; 0 ignored; 0 measured; 0 filtered out; finished in 0.00s