running 1 test test gic::tests::exhausted_route_slots_are_skipped_and_never_wrap ... FAILED failures: failures: gic::tests::exhausted_route_slots_are_skipped_and_never_wrap test result: FAILED. 0 passed; 1 failed; 0 ignored; 0 measured; 4 filtered out; finished in 0.00s Compiling turkos-os-gic v0.1.0 (/reports/os-implementation/K921-K939-preparation-7Bk1ve/mutant-retired-generation-reused/os-gic) warning: unused variable: `slot` --> src/gic.rs:376:29 | 376 | .position(|(slot, row)| row.is_none()) | ^^^^ help: if this is intentional, prefix it with an underscore: `_slot` | = note: `#[warn(unused_variables)]` (part of `#[warn(unused)]`) on by default warning: `turkos-os-gic` (lib test) generated 1 warning (run `cargo fix --lib -p turkos-os-gic --tests` to apply 1 suggestion) Finished `test` profile [unoptimized + debuginfo] target(s) in 0.20s Running unittests src/lib.rs (reports/os-implementation/K921-K939-preparation-7Bk1ve/mutant-retired-generation-reused/target/debug/build/turkos-os-gic/1481543171ef58a0/out/turkos_os_gic-1481543171ef58a0) thread 'gic::tests::exhausted_route_slots_are_skipped_and_never_wrap' (41340593) panicked at src/gic.rs:400:26: attempt to add with overflow note: run with `RUST_BACKTRACE=1` environment variable to display a backtrace error: test failed, to rerun pass `--lib`