running 1 test test os_handles_rights_negative ... FAILED failures: failures: os_handles_rights_negative test result: FAILED. 0 passed; 1 failed; 0 ignored; 0 measured; 2 filtered out; finished in 0.00s thread 'os_handles_rights_negative' (48450657) panicked at /reports/os-implementation/K1315-handles-rights-local-preflight-Rp3G5H/workspace/kernel/tests/os/handles_rights.rs:44:5: assertion `left == right` failed left: Err(Full) right: Err(Access) note: run with `RUST_BACKTRACE=1` environment variable to display a backtrace