running 3 tests test os_pci_discovery_ecam_window_validation ... ok test os_pci_discovery_ecam_positive ... ok test os_pci_discovery_ecam_negative ... FAILED failures: ---- os_pci_discovery_ecam_negative stdout ---- thread 'os_pci_discovery_ecam_negative' (49015360) panicked at /reports/os-implementation/K1425-pci-ecam-local-LmbPPA/mutant/kernel/tests/os/pci_discovery.rs:32:5: assertion `left == right` failed left: Err(InvalidWindow) right: Err(BusOutOfRange) note: run with `RUST_BACKTRACE=1` environment variable to display a backtrace failures: os_pci_discovery_ecam_negative test result: FAILED. 2 passed; 1 failed; 0 ignored; 0 measured; 0 filtered out; finished in 0.00s