running 1 test test os_threads_retire_negative ... FAILED failures: failures: os_threads_retire_negative test result: FAILED. 0 passed; 1 failed; 0 ignored; 0 measured; 21 filtered out; finished in 0.00s Compiling turkos-os-threads v0.1.0 (/reports/os-implementation/K1001-K1019-preparation-Vy7GRN/mutant-self-stack-reaped/os-threads) warning: unused variable: `context` --> src/threads.rs:485:13 | 485 | let context = self.context()?; | ^^^^^^^ help: if this is intentional, prefix it with an underscore: `_context` | = note: `#[warn(unused_variables)]` (part of `#[warn(unused)]`) on by default warning: `turkos-os-threads` (lib) generated 1 warning (run `cargo fix --lib -p turkos-os-threads` to apply 1 suggestion) Finished `test` profile [unoptimized + debuginfo] target(s) in 0.29s Running tests/threads.rs (reports/os-implementation/K1001-K1019-preparation-Vy7GRN/mutant-self-stack-reaped/target/debug/build/turkos-os-threads/fc0d96e38d2f6d6f/out/threads-fc0d96e38d2f6d6f) thread 'os_threads_retire_negative' (41558867) panicked at tests/threads.rs:273:5: assertion `left == right` failed left: Ok(()) right: Err(ActiveStack) note: run with `RUST_BACKTRACE=1` environment variable to display a backtrace error: test failed, to rerun pass `--test threads`