running 1 test test os_kernel_heap_classes_negative ... FAILED failures: ---- os_kernel_heap_classes_negative stdout ---- thread 'os_kernel_heap_classes_negative' (40962980) panicked at tests/heap.rs:98:9: assertion `left == right` failed left: Ok(Handle { heap: 1, slot: 0, generation: 1, owner: 1, address: 1073741824 }) right: Err(InvalidLayout) note: run with `RUST_BACKTRACE=1` environment variable to display a backtrace failures: os_kernel_heap_classes_negative test result: FAILED. 0 passed; 1 failed; 0 ignored; 0 measured; 12 filtered out; finished in 0.00s Compiling turkos-os-kernel-heap v0.1.0 (/reports/os-implementation/K761-K779-preparation-KNIrm3/mutant-zero-layout/os-kernel-heap) Finished `test` profile [unoptimized + debuginfo] target(s) in 0.29s Running tests/heap.rs (reports/os-implementation/K761-K779-preparation-KNIrm3/mutant-zero-layout/target/debug/build/turkos-os-kernel-heap/04dbad547e5317ad/out/heap-04dbad547e5317ad) error: test failed, to rerun pass `--test heap`