running 2 tests test os_vfs_superblock_positive ... ok test os_vfs_superblock_negative ... FAILED failures: ---- os_vfs_superblock_negative stdout ---- thread 'os_vfs_superblock_negative' (50183912) panicked at /reports/os-implementation/K1605-vfs-superblock-local-WPLHK0/mutant/kernel/tests/os/vfs_superblock.rs:27:5: assertion `left == right` failed left: Ok(Superblock { version: 1, total_blocks: 2048, root_inode: 1, generation: 7 }) right: Err(UnsupportedVersion) note: run with `RUST_BACKTRACE=1` environment variable to display a backtrace failures: os_vfs_superblock_negative test result: FAILED. 1 passed; 1 failed; 0 ignored; 0 measured; 0 filtered out; finished in 0.00s