running 2 tests test os_turkfs_reader_extents_positive ... ok test os_turkfs_reader_extents_negative ... FAILED failures: ---- os_turkfs_reader_extents_negative stdout ---- thread 'os_turkfs_reader_extents_negative' (50227654) panicked at /reports/os-implementation/K1615-turkfs-reader-local-KbG4LA/mutant/kernel/tests/os/turkfs_reader.rs:41:5: assertion `left == right` failed left: Ok(File { extents: [Extent { first_block: 100, block_count: 1 }, Extent { first_block: 100, block_count: 1 }, Extent { first_block: 108, block_count: 1 }], size: 1300 }) right: Err(Overlap) note: run with `RUST_BACKTRACE=1` environment variable to display a backtrace failures: os_turkfs_reader_extents_negative test result: FAILED. 1 passed; 1 failed; 0 ignored; 0 measured; 0 filtered out; finished in 0.00s