running 1 test test early_free_of_active_pinned_page_is_rejected_without_owner_change ... FAILED failures: ---- early_free_of_active_pinned_page_is_rejected_without_owner_change stdout ---- thread 'early_free_of_active_pinned_page_is_rejected_without_owner_change' (47664316) panicked at tests/process_table.rs:1065:5: assertion `left == right` failed left: Ok(()) right: Err(Pinned) note: run with `RUST_BACKTRACE=1` environment variable to display a backtrace failures: early_free_of_active_pinned_page_is_rejected_without_owner_change test result: FAILED. 0 passed; 1 failed; 0 ignored; 0 measured; 33 filtered out; finished in 0.00s Compiling turkos-os-threads v0.1.0 (/reports/os-implementation/K1200-retirement-local-preflight-isjuew/mutant-workspace/os-threads) Compiling turkos-os-frame-metadata v0.1.0 (/reports/os-implementation/K1200-retirement-local-preflight-isjuew/mutant-workspace/os-frame-metadata) Compiling turkos-os-address-spaces v0.1.0 (/reports/os-implementation/K1200-retirement-local-preflight-isjuew/mutant-workspace/os-address-spaces) Compiling turkos-os-process-table v0.1.0 (/reports/os-implementation/K1200-retirement-local-preflight-isjuew/mutant-workspace/os-process-table) Finished `test` profile [unoptimized + debuginfo] target(s) in 0.40s Running tests/process_table.rs (reports/os-implementation/K1200-retirement-local-preflight-isjuew/target/debug/build/turkos-os-process-table/458211d30f19ef84/out/process_table-458211d30f19ef84) error: test failed, to rerun pass `--test process_table`