running 1 test test same_scope_foreign_tokens_cannot_act_on_matching_live_instances ... FAILED failures: failures: same_scope_foreign_tokens_cannot_act_on_matching_live_instances test result: FAILED. 0 passed; 1 failed; 0 ignored; 0 measured; 25 filtered out; finished in 0.00s Compiling turkos-os-gic v0.1.0 (/reports/os-implementation/K921-K939-preparation-7Bk1ve/mutant-foreign-dispatch/os-gic) warning: field `instance` is never read --> src/gic.rs:130:5 | 129 | pub struct Dispatch { | -------- field in this struct 130 | instance: u64, | ^^^^^^^^ | = note: `Dispatch` has a derived impl for the trait `Debug`, but this is intentionally ignored during dead code analysis = note: `#[warn(dead_code)]` (part of `#[warn(unused)]`) on by default warning: `turkos-os-gic` (lib) generated 1 warning Finished `test` profile [unoptimized + debuginfo] target(s) in 0.37s Running tests/gic.rs (reports/os-implementation/K921-K939-preparation-7Bk1ve/mutant-foreign-dispatch/target/debug/build/turkos-os-gic/504a3f6ce8f6a297/out/gic-504a3f6ce8f6a297) thread 'same_scope_foreign_tokens_cannot_act_on_matching_live_instances' (41337363) panicked at tests/gic.rs:520:5: assertion `left == right` failed left: Ok(Work { completed: 1, deferred: false, closing: false }) right: Err(Foreign) note: run with `RUST_BACKTRACE=1` environment variable to display a backtrace error: test failed, to rerun pass `--test gic`