running 2 tests test os_turkfs_journal_format_positive ... ok test os_turkfs_journal_format_negative ... FAILED failures: ---- os_turkfs_journal_format_negative stdout ---- thread 'os_turkfs_journal_format_negative' (50524397) panicked at /reports/os-implementation/K1665-turkfs-journal-local-cRaFID/mutant/kernel/tests/os/turkfs_journal.rs:25:5: assertion `left == right` failed left: Ok(Transaction { sequence: 7, records: [Record { kind: Inode, block: 120, payload: [17, 17, 17, 17, 17, 17, 17, 17, 17, 17, 17, 17, 17, 17, 17, 17] }, Record { kind: Bitmap, block: 128, payload: [34, 34, 34, 34, 34, 34, 34, 34, 34, 34, 34, 34, 34, 34, 34, 34] }, Record { kind: Directory, block: 136, payload: [51, 51, 51, 51, 51, 51, 51, 51, 51, 51, 51, 51, 51, 51, 51, 50] }] }) right: Err(Checksum) note: run with `RUST_BACKTRACE=1` environment variable to display a backtrace failures: os_turkfs_journal_format_negative test result: FAILED. 1 passed; 1 failed; 0 ignored; 0 measured; 0 filtered out; finished in 0.00s