running 2 tests test os_block_io_geometry_first_and_last ... ok test os_block_io_geometry_overflow_and_outside ... FAILED failures: ---- os_block_io_geometry_overflow_and_outside stdout ---- thread 'os_block_io_geometry_overflow_and_outside' (49644518) panicked at /reports/os-implementation/K1505-block-geometry-local-jLqGcs/mutant/kernel/tests/os/block_geometry.rs:25:5: assertion `left == right` failed left: Ok(Span { first_lba: 2048, sector_count: 1, first_byte: 1048576, end_byte: 1049088 }) right: Err(OutsideCapacity) note: run with `RUST_BACKTRACE=1` environment variable to display a backtrace failures: os_block_io_geometry_overflow_and_outside test result: FAILED. 1 passed; 1 failed; 0 ignored; 0 measured; 0 filtered out; finished in 0.00s