running 1 test test malformed_timer_origin_status_and_every_frame_owner_field_refuse ... FAILED failures: failures: malformed_timer_origin_status_and_every_frame_owner_field_refuse test result: FAILED. 0 passed; 1 failed; 0 ignored; 0 measured; 32 filtered out; finished in 0.00s Compiling turkos-os-exceptions v0.1.0 (/reports/os-implementation/K1021-K1039-preparation-EkLAoy/mutant-timer-origin-status-ignored/os-exceptions) Compiling turkos-os-threads v0.1.0 (/reports/os-implementation/K1021-K1039-preparation-EkLAoy/mutant-timer-origin-status-ignored/os-threads) Compiling turkos-os-context-switch v0.1.0 (/reports/os-implementation/K1021-K1039-preparation-EkLAoy/mutant-timer-origin-status-ignored/os-context-switch) Finished `test` profile [unoptimized + debuginfo] target(s) in 0.43s Running tests/context.rs (reports/os-implementation/K1021-K1039-preparation-EkLAoy/mutant-timer-origin-status-ignored/target/debug/build/turkos-os-context-switch/93ddcea86e955723/out/context-93ddcea86e955723) thread 'malformed_timer_origin_status_and_every_frame_owner_field_refuse' (41796032) panicked at tests/context.rs:385:9: assertion failed: bank.timer(a, b, c).is_err() note: run with `RUST_BACKTRACE=1` environment variable to display a backtrace error: test failed, to rerun pass `--test context`