running 1 test test os_gic_teardown_positive ... FAILED failures: failures: os_gic_teardown_positive test result: FAILED. 0 passed; 1 failed; 0 ignored; 0 measured; 25 filtered out; finished in 0.00s Compiling turkos-os-gic v0.1.0 (/reports/os-implementation/K921-K939-preparation-7Bk1ve/mutant-return-barrier-skipped/os-gic) Finished `test` profile [unoptimized + debuginfo] target(s) in 0.37s Running tests/gic.rs (reports/os-implementation/K921-K939-preparation-7Bk1ve/mutant-return-barrier-skipped/target/debug/build/turkos-os-gic/504a3f6ce8f6a297/out/gic-504a3f6ce8f6a297) thread 'os_gic_teardown_positive' (41338858) panicked at tests/gic.rs:447:9: assertion `left == right` failed left: [Eoi(33), Dir(33), Release(1)] right: [Eoi(33), Dir(33), Barrier, Release(1)] note: run with `RUST_BACKTRACE=1` environment variable to display a backtrace error: test failed, to rerun pass `--test gic`