running 1 test test every_register_bit_must_match_in_both_boot_paths ... FAILED failures: failures: every_register_bit_must_match_in_both_boot_paths test result: FAILED. 0 passed; 1 failed; 0 ignored; 0 measured; 7 filtered out; finished in 0.00s Compiling turkos-os-entry-arguments v0.1.0 (/reports/os-implementation/K636-K639-uqt4Qk/mutant-ignore-x0/os-entry-arguments) Finished `test` profile [unoptimized + debuginfo] target(s) in 0.20s Running tests/arguments.rs (reports/os-implementation/K636-K639-uqt4Qk/mutant-ignore-x0/target/debug/build/turkos-os-entry-arguments/7e23202805a1d2d4/out/arguments-7e23202805a1d2d4) thread 'every_register_bit_must_match_in_both_boot_paths' (40758982) panicked at tests/arguments.rs:80:13: assertion `left == right` failed left: Ok(Accepted { registers: Registers { x0: 1073741825, x1: 0 }, path: Direct }) right: Err(X0Changed) note: run with `RUST_BACKTRACE=1` environment variable to display a backtrace error: test failed, to rerun pass `--test arguments`