running 1 test test irq_service_and_recovery_are_refused_before_any_resource_access ... FAILED failures: ---- irq_service_and_recovery_are_refused_before_any_resource_access stdout ---- thread 'irq_service_and_recovery_are_refused_before_any_resource_access' (41610925) panicked at tests/deferred_work.rs:511:5: assertion `left == right` failed left: Ok(()) right: Err(Context) note: run with `RUST_BACKTRACE=1` environment variable to display a backtrace failures: irq_service_and_recovery_are_refused_before_any_resource_access test result: FAILED. 0 passed; 1 failed; 0 ignored; 0 measured; 27 filtered out; finished in 0.00s Compiling turkos-os-deferred-work v0.1.0 (/reports/os-implementation/K981-K999-preparation-0bsVMr/mutant-missing-task-gate/os-deferred-work) Finished `test` profile [unoptimized + debuginfo] target(s) in 0.48s Running tests/deferred_work.rs (reports/os-implementation/K981-K999-preparation-0bsVMr/mutant-missing-task-gate/target/debug/build/turkos-os-deferred-work/bfb4bf5e81b06a44/out/deferred_work-bfb4bf5e81b06a44) error: test failed, to rerun pass `--test deferred_work`