running 1 test test os_entry_sections_negative ... FAILED failures: failures: os_entry_sections_negative test result: FAILED. 0 passed; 1 failed; 0 ignored; 0 measured; 8 filtered out; finished in 0.00s Compiling turkos-os-entry-sections v0.1.0 (/reports/os-implementation/K626-K629-XLzoBa/mutant-accept-overlap/os-entry-sections) Finished `test` profile [unoptimized + debuginfo] target(s) in 0.22s Running tests/sections.rs (reports/os-implementation/K626-K629-XLzoBa/mutant-accept-overlap/target/debug/build/turkos-os-entry-sections/8b855fd6dab4304a/out/sections-8b855fd6dab4304a) thread 'os_entry_sections_negative' (40738972) panicked at tests/sections.rs:30:5: assertion `left == right` failed left: Ok(Sections { image_start: 1074266112, text_start: 1074270208, text_end: 1074331648, rodata_end: 1074348032, bss_start: 1074274304, bss_end: 1074397184 }) right: Err(Overlap) note: run with `RUST_BACKTRACE=1` environment variable to display a backtrace error: test failed, to rerun pass `--test sections`