running 2 tests test os_vfs_paths_open_positive ... ok test os_vfs_paths_open_negative ... FAILED failures: ---- os_vfs_paths_open_negative stdout ---- thread 'os_vfs_paths_open_negative' (49979443) panicked at /reports/os-implementation/K1565-vfs-ro-open-local-gbaMjE/mutant/kernel/tests/os/vfs_open.rs:41:5: assertion `left == right` failed left: Ok(Handle { id: 1, volume: 2, inode: 22, mount_generation: 1, read: true }) right: Err(Erofs) note: run with `RUST_BACKTRACE=1` environment variable to display a backtrace failures: os_vfs_paths_open_negative test result: FAILED. 1 passed; 1 failed; 0 ignored; 0 measured; 0 filtered out; finished in 0.00s