running 1 test test overlapping_live_frames_are_rejected_before_issue ... FAILED failures: ---- overlapping_live_frames_are_rejected_before_issue stdout ---- thread 'overlapping_live_frames_are_rejected_before_issue' (41253714) panicked at tests/exceptions.rs:488:5: assertion `left == right` failed left: Ok(EntryToken { controller: 1, generation: 2, depth: 2, frame: 1073806480, slot: 5, live: true }) right: Err(Frame) note: run with `RUST_BACKTRACE=1` environment variable to display a backtrace failures: overlapping_live_frames_are_rejected_before_issue test result: FAILED. 0 passed; 1 failed; 0 ignored; 0 measured; 22 filtered out; finished in 0.00s Compiling turkos-os-exceptions v0.1.0 (/reports/os-implementation/K901-K919-preparation-EQ5mcc/mutant-overlapping-frames/os-exceptions) warning: unused variable: `entry` --> src/exceptions.rs:465:61 | 465 | if self.entries[..self.depth].iter().flatten().any(|entry| { | ^^^^^ help: if this is intentional, prefix it with an underscore: `_entry` | = note: `#[warn(unused_variables)]` (part of `#[warn(unused)]`) on by default warning: `turkos-os-exceptions` (lib) generated 1 warning (run `cargo fix --lib -p turkos-os-exceptions` to apply 1 suggestion) Finished `test` profile [unoptimized + debuginfo] target(s) in 0.26s Running tests/exceptions.rs (reports/os-implementation/K901-K919-preparation-EQ5mcc/mutant-overlapping-frames/target/debug/build/turkos-os-exceptions/75414a6222e92fd7/out/exceptions-75414a6222e92fd7) error: test failed, to rerun pass `--test exceptions`