running 1 test test wrong_owner_registration_cannot_mask_or_free_live_resource ... FAILED failures: failures: wrong_owner_registration_cannot_mask_or_free_live_resource test result: FAILED. 0 passed; 1 failed; 0 ignored; 0 measured; 25 filtered out; finished in 0.00s Compiling turkos-os-gic v0.1.0 (/reports/os-implementation/K921-K939-preparation-7Bk1ve/mutant-wrong-owner/os-gic) warning: unused variable: `owner` --> src/gic.rs:306:55 | 306 | fn registration_slot(&self, token: &Registration, owner: u64) -> Result { | ^^^^^ help: if this is intentional, prefix it with an underscore: `_owner` | = note: `#[warn(unused_variables)]` (part of `#[warn(unused)]`) on by default warning: `turkos-os-gic` (lib) generated 1 warning (run `cargo fix --lib -p turkos-os-gic` to apply 1 suggestion) Finished `test` profile [unoptimized + debuginfo] target(s) in 0.38s Running tests/gic.rs (reports/os-implementation/K921-K939-preparation-7Bk1ve/mutant-wrong-owner/target/debug/build/turkos-os-gic/504a3f6ce8f6a297/out/gic-504a3f6ce8f6a297) thread 'wrong_owner_registration_cannot_mask_or_free_live_resource' (41336918) panicked at tests/gic.rs:705:5: assertion `left == right` failed left: Ok(Released) right: Err(Foreign) note: run with `RUST_BACKTRACE=1` environment variable to display a backtrace error: test failed, to rerun pass `--test gic`