running 1 test test irq::exhaustion_tests::depth_exhaustion_never_writes_registers ... FAILED failures: failures: irq::exhaustion_tests::depth_exhaustion_never_writes_registers test result: FAILED. 0 passed; 1 failed; 0 ignored; 0 measured; 5 filtered out; finished in 0.00s Compiling turkos-os-locking v0.1.0 (/reports/os-implementation/K961-K979-preparation-HHDGYT/mutant-irq-depth-wrap/os-locking) Finished `test` profile [unoptimized + debuginfo] target(s) in 0.22s Running unittests src/lib.rs (reports/os-implementation/K961-K979-preparation-HHDGYT/mutant-irq-depth-wrap/target/debug/build/turkos-os-locking/5813bd7aeb4d174b/out/turkos_os_locking-5813bd7aeb4d174b) thread 'irq::exhaustion_tests::depth_exhaustion_never_writes_registers' (41475511) panicked at src/irq.rs:173:9: assertion failed: matches!(state.enter(), Err(Error::Overflow)) note: run with `RUST_BACKTRACE=1` environment variable to display a backtrace error: test failed, to rerun pass `--lib`