running 1 test test idle_after_failure_and_bad_atomic_receipt_retain_wake_custody ... FAILED failures: failures: idle_after_failure_and_bad_atomic_receipt_retain_wake_custody test result: FAILED. 0 passed; 1 failed; 0 ignored; 0 measured; 32 filtered out; finished in 0.00s Compiling turkos-os-threads v0.1.0 (/reports/os-implementation/K1021-K1039-preparation-EkLAoy/mutant-atomic-idle-receipt-ignored/os-threads) Compiling turkos-os-exceptions v0.1.0 (/reports/os-implementation/K1021-K1039-preparation-EkLAoy/mutant-atomic-idle-receipt-ignored/os-exceptions) Compiling turkos-os-context-switch v0.1.0 (/reports/os-implementation/K1021-K1039-preparation-EkLAoy/mutant-atomic-idle-receipt-ignored/os-context-switch) Finished `test` profile [unoptimized + debuginfo] target(s) in 0.41s Running tests/context.rs (reports/os-implementation/K1021-K1039-preparation-EkLAoy/mutant-atomic-idle-receipt-ignored/target/debug/build/turkos-os-context-switch/457610726199ba6a/out/context-457610726199ba6a) thread 'idle_after_failure_and_bad_atomic_receipt_retain_wake_custody' (41795573) panicked at tests/context.rs:446:9: assertion failed: matches!(idle.complete(), Err(DispatchError::Quarantined(_))) note: run with `RUST_BACKTRACE=1` environment variable to display a backtrace error: test failed, to rerun pass `--test context`