running 1 test test foreign_bank_keeps_actual_handle_and_both_programs_unchanged ... FAILED failures: failures: foreign_bank_keeps_actual_handle_and_both_programs_unchanged test result: FAILED. 0 passed; 1 failed; 0 ignored; 0 measured; 20 filtered out; finished in 0.00s Compiling turkos-os-clock v0.1.0 (/reports/os-implementation/K941-K959-preparation-T8L8pi/mutant-foreign-bank/os-clock) warning: field `bank` is never read --> src/clock.rs:75:5 | 74 | pub struct Handle { | ------ field in this struct 75 | bank: u64, | ^^^^ | = note: `Handle` has a derived impl for the trait `Debug`, but this is intentionally ignored during dead code analysis = note: `#[warn(dead_code)]` (part of `#[warn(unused)]`) on by default warning: `turkos-os-clock` (lib) generated 1 warning Finished `test` profile [unoptimized + debuginfo] target(s) in 0.28s Running tests/clock.rs (reports/os-implementation/K941-K959-preparation-T8L8pi/mutant-foreign-bank/target/debug/build/turkos-os-clock/7e205e95b363aa97/out/clock-7e205e95b363aa97) thread 'foreign_bank_keeps_actual_handle_and_both_programs_unchanged' (41397446) panicked at tests/clock.rs:263:47: called `Result::unwrap_err()` on an `Ok` value: () note: run with `RUST_BACKTRACE=1` environment variable to display a backtrace error: test failed, to rerun pass `--test clock`