running 1 test test os_runqueue_priority_positive ... FAILED failures: failures: os_runqueue_priority_positive test result: FAILED. 0 passed; 1 failed; 0 ignored; 0 measured; 21 filtered out; finished in 0.00s Compiling turkos-os-exceptions v0.1.0 (/reports/os-implementation/K1041-K1059-preparation-5hOulI/mutant-low-class-inflated/os-exceptions) Compiling turkos-os-threads v0.1.0 (/reports/os-implementation/K1041-K1059-preparation-5hOulI/mutant-low-class-inflated/os-threads) Compiling turkos-os-context-switch v0.1.0 (/reports/os-implementation/K1041-K1059-preparation-5hOulI/mutant-low-class-inflated/os-context-switch) Compiling turkos-os-runqueue v0.1.0 (/reports/os-implementation/K1041-K1059-preparation-5hOulI/mutant-low-class-inflated/os-runqueue) Finished `test` profile [unoptimized + debuginfo] target(s) in 0.66s Running tests/runqueue.rs (reports/os-implementation/K1041-K1059-preparation-5hOulI/mutant-low-class-inflated/target/debug/build/turkos-os-runqueue/5d33f87d93fa3746/out/runqueue-5d33f87d93fa3746) thread 'os_runqueue_priority_positive' (41915900) panicked at tests/runqueue.rs:135:5: assertion `left == right` failed left: [40, 40] right: [40, 20] note: run with `RUST_BACKTRACE=1` environment variable to display a backtrace error: test failed, to rerun pass `--test runqueue`