running 1 test test actual_irq_cpu_and_daif_observer_cannot_be_overridden_by_forged_task_argument ... FAILED failures: ---- actual_irq_cpu_and_daif_observer_cannot_be_overridden_by_forged_task_argument stdout ---- thread 'actual_irq_cpu_and_daif_observer_cannot_be_overridden_by_forged_task_argument' (41611883) panicked at tests/deferred_work.rs:296:5: assertion `left == right` failed left: Err(Quarantined) right: Err(Context) note: run with `RUST_BACKTRACE=1` environment variable to display a backtrace failures: actual_irq_cpu_and_daif_observer_cannot_be_overridden_by_forged_task_argument test result: FAILED. 0 passed; 1 failed; 0 ignored; 0 measured; 27 filtered out; finished in 0.00s Compiling turkos-os-deferred-work v0.1.0 (/reports/os-implementation/K981-K999-preparation-0bsVMr/mutant-missing-actual-recovery-context/os-deferred-work) Finished `test` profile [unoptimized + debuginfo] target(s) in 0.51s Running tests/deferred_work.rs (reports/os-implementation/K981-K999-preparation-0bsVMr/mutant-missing-actual-recovery-context/target/debug/build/turkos-os-deferred-work/bfb4bf5e81b06a44/out/deferred_work-bfb4bf5e81b06a44) error: test failed, to rerun pass `--test deferred_work`