running 1 test test zero_period_and_invalid_owner_refuse_without_program ... FAILED failures: failures: zero_period_and_invalid_owner_refuse_without_program test result: FAILED. 0 passed; 1 failed; 0 ignored; 0 measured; 20 filtered out; finished in 0.00s Compiling turkos-os-clock v0.1.0 (/reports/os-implementation/K941-K959-preparation-T8L8pi/mutant-invalid-owner/os-clock) warning: method `valid` is never used --> src/clock.rs:56:8 | 55 | impl Owner { | ---------- method in this implementation 56 | fn valid(self) -> bool { | ^^^^^ | = note: `#[warn(dead_code)]` (part of `#[warn(unused)]`) on by default warning: `turkos-os-clock` (lib) generated 1 warning Finished `test` profile [unoptimized + debuginfo] target(s) in 0.28s Running tests/clock.rs (reports/os-implementation/K941-K959-preparation-T8L8pi/mutant-invalid-owner/target/debug/build/turkos-os-clock/7e205e95b363aa97/out/clock-7e205e95b363aa97) thread 'zero_period_and_invalid_owner_refuse_without_program' (41398048) panicked at tests/clock.rs:421:10: called `Result::unwrap_err()` on an `Ok` value: Handle { bank: 1, slot: 0, owner: Owner { id: 0, generation: 1 }, generation: 1 } note: run with `RUST_BACKTRACE=1` environment variable to display a backtrace error: test failed, to rerun pass `--test clock`