running 1 test test failed_anonymous_rollback_retains_actual_private_token_for_retry ... FAILED failures: failures: failed_anonymous_rollback_retains_actual_private_token_for_retry test result: FAILED. 0 passed; 1 failed; 0 ignored; 0 measured; 22 filtered out; finished in 0.01s Compiling turkos-os-page-tables v0.1.0 (/os-page-tables) Compiling turkos-os-runtime-platform v0.1.0 (/os-runtime-platform) Compiling turkos-os-frame-metadata v0.1.0 (/os-frame-metadata) Compiling turkos-os-mapping v0.1.0 (/os-mapping) Compiling turkos-os-frame-authority v0.1.0 (/os-frame-authority) Compiling turkos-os-page-faults v0.1.0 (/reports/os-implementation/K881-K899-preparation-EmtNWF/mutant-lost-rollback-owner/os-page-faults) Finished `test` profile [unoptimized + debuginfo] target(s) in 0.58s Running tests/page_faults.rs (reports/os-implementation/K881-K899-preparation-EmtNWF/mutant-lost-rollback-owner/target/debug/build/turkos-os-page-faults/576484b42b3fefe1/out/page_faults-576484b42b3fefe1) thread 'failed_anonymous_rollback_retains_actual_private_token_for_retry' (41242019) panicked at tests/page_faults.rs:553:5: assertion `left == right` failed left: 0 right: 1 note: run with `RUST_BACKTRACE=1` environment variable to display a backtrace error: test failed, to rerun pass `--test page_faults`