running 1 test test origin_negative_zero_x1_with_payload_is_not_silently_direct ... FAILED failures: failures: origin_negative_zero_x1_with_payload_is_not_silently_direct test result: FAILED. 0 passed; 1 failed; 0 ignored; 0 measured; 17 filtered out; finished in 0.00s Compiling typenum v1.20.1 Compiling libc v0.2.190 Compiling cfg-if v1.0.5 Compiling turkos-bootinfo v0.0.1 (/reports/os-implementation/K601-K604-bSl4iH/direct-ignores-payload/bootinfo) Compiling hybrid-array v0.4.15 Compiling crypto-common v0.2.2 Compiling block-buffer v0.12.1 Compiling cpufeatures v0.3.1 Compiling digest v0.11.3 Compiling sha2 v0.11.0 Compiling turkos-kernel v0.0.1 (/reports/os-implementation/K601-K604-bSl4iH/direct-ignores-payload/kernel) Compiling turkos-os-runtime v0.0.1 (/reports/os-implementation/K601-K604-bSl4iH/direct-ignores-payload/os-runtime) Finished `test` profile [unoptimized + debuginfo] target(s) in 1.58s Running tests/boot_contract.rs (reports/os-implementation/K601-K604-bSl4iH/direct-ignores-payload/target/debug/build/turkos-os-runtime/af9f0f2c7bf03e59/out/boot_contract-af9f0f2c7bf03e59) thread 'origin_negative_zero_x1_with_payload_is_not_silently_direct' (39417087) panicked at tests/boot_contract.rs:136:10: called `Result::unwrap_err()` on an `Ok` value: ResolvedBoot { origin: DirectImage, ram: PhysicalRange { start: 1073741824, end: 1342177280 }, dtb: PhysicalRange { start: 1340080128, end: 1340080446 }, uart_base: 150994944, boot_info: None } note: run with `RUST_BACKTRACE=1` environment variable to display a backtrace error: test failed, to rerun pass `--test boot_contract`