running 1 test test deferred_work::tests::registration_generation_exhaustion_retires_slot_before_acquisition ... FAILED failures: ---- deferred_work::tests::registration_generation_exhaustion_retires_slot_before_acquisition stdout ---- thread 'deferred_work::tests::registration_generation_exhaustion_retires_slot_before_acquisition' (41614476) panicked at src/deferred_work.rs:233:46: called `Result::unwrap_err()` on an `Ok` value: Registration { namespace: 1, record: SourceRecord { state: Open, slot: 0, generation: 0, binding: Binding { device: 9, epoch: 1, owner: 7, cpu: 0 }, resource: 1 } } note: run with `RUST_BACKTRACE=1` environment variable to display a backtrace failures: deferred_work::tests::registration_generation_exhaustion_retires_slot_before_acquisition test result: FAILED. 0 passed; 1 failed; 0 ignored; 0 measured; 5 filtered out; finished in 0.00s Compiling turkos-os-deferred-work v0.1.0 (/reports/os-implementation/K981-K999-preparation-0bsVMr/mutant-wrapping-registration-generation/os-deferred-work) Finished `test` profile [unoptimized + debuginfo] target(s) in 0.30s Running unittests src/lib.rs (reports/os-implementation/K981-K999-preparation-0bsVMr/mutant-wrapping-registration-generation/target/debug/build/turkos-os-deferred-work/f5f2a0d501c10246/out/turkos_os_deferred_work-f5f2a0d501c10246) error: test failed, to rerun pass `--lib`