running 1 test test single_outcome_before_and_after_child_exit ... FAILED failures: ---- single_outcome_before_and_after_child_exit stdout ---- thread 'single_outcome_before_and_after_child_exit' (47500163) panicked at tests/process_table.rs:853:5: assertion `left == right` failed left: Ok(Exited(0)) right: Err(NoChild) note: run with `RUST_BACKTRACE=1` environment variable to display a backtrace failures: single_outcome_before_and_after_child_exit test result: FAILED. 0 passed; 1 failed; 0 ignored; 0 measured; 27 filtered out; finished in 0.00s Compiling turkos-os-threads v0.1.0 (/reports/os-implementation/K1190-wait-local-preflight-ECdTrV/mutant-workspace/os-threads) Compiling turkos-os-frame-metadata v0.1.0 (/reports/os-implementation/K1190-wait-local-preflight-ECdTrV/mutant-workspace/os-frame-metadata) Compiling turkos-os-address-spaces v0.1.0 (/reports/os-implementation/K1190-wait-local-preflight-ECdTrV/mutant-workspace/os-address-spaces) Compiling turkos-os-process-table v0.1.0 (/reports/os-implementation/K1190-wait-local-preflight-ECdTrV/mutant-workspace/os-process-table) Finished `test` profile [unoptimized + debuginfo] target(s) in 0.37s Running tests/process_table.rs (reports/os-implementation/K1190-wait-local-preflight-ECdTrV/target/debug/build/turkos-os-process-table/74f09523f3c61591/out/process_table-74f09523f3c61591) error: test failed, to rerun pass `--test process_table`