running 1 test test os_user_api_io_negative ... FAILED failures: ---- os_user_api_io_negative stdout ---- thread 'os_user_api_io_negative' (47946100) panicked at tests/io.rs:44:5: assertion `left == right` failed left: Ok(Outcome { bytes: 1, calls: 3, interruptions: 0 }) right: Err(Stalled(Outcome { bytes: 0, calls: 2, interruptions: 0 })) note: run with `RUST_BACKTRACE=1` environment variable to display a backtrace failures: os_user_api_io_negative test result: FAILED. 0 passed; 1 failed; 0 ignored; 0 measured; 5 filtered out; finished in 0.00s Compiling turkos-os-user-runtime-io v0.1.0 (/reports/os-implementation/K1230-bounded-io-local-preflight-30wVPZ/workspace/os-user-runtime-io) Finished `test` profile [unoptimized + debuginfo] target(s) in 0.14s Running tests/io.rs (reports/os-implementation/K1230-bounded-io-local-preflight-30wVPZ/target/debug/build/turkos-os-user-runtime-io/d8eca8648f2006b1/out/io-d8eca8648f2006b1) error: test failed, to rerun pass `--test io`