running 1 test test unknown_iss2_fnv_walk_cache_external_and_atomic_status_fail_closed ... FAILED failures: failures: unknown_iss2_fnv_walk_cache_external_and_atomic_status_fail_closed test result: FAILED. 0 passed; 1 failed; 0 ignored; 0 measured; 22 filtered out; finished in 0.00s Compiling turkos-os-page-tables v0.1.0 (/os-page-tables) Compiling turkos-os-runtime-platform v0.1.0 (/os-runtime-platform) Compiling turkos-os-frame-metadata v0.1.0 (/os-frame-metadata) Compiling turkos-os-mapping v0.1.0 (/os-mapping) Compiling turkos-os-frame-authority v0.1.0 (/os-frame-authority) Compiling turkos-os-page-faults v0.1.0 (/reports/os-implementation/K881-K899-preparation-EmtNWF/mutant-unknown-iss2/os-page-faults) Finished `test` profile [unoptimized + debuginfo] target(s) in 0.57s Running tests/page_faults.rs (reports/os-implementation/K881-K899-preparation-EmtNWF/mutant-unknown-iss2/target/debug/build/turkos-os-page-faults/576484b42b3fefe1/out/page_faults-576484b42b3fefe1) thread 'unknown_iss2_fnv_walk_cache_external_and_atomic_status_fail_closed' (41238495) panicked at tests/page_faults.rs:440:9: assertion failed: matches!(classify::classify(bad), Classification::Unsupported(_)) note: run with `RUST_BACKTRACE=1` environment variable to display a backtrace error: test failed, to rerun pass `--test page_faults`