running 1 test test device_queue_epoch_and_scope_rejections_preserve_actual_pins ... FAILED failures: ---- device_queue_epoch_and_scope_rejections_preserve_actual_pins stdout ---- thread 'device_queue_epoch_and_scope_rejections_preserve_actual_pins' (41038369) panicked at tests/dma.rs:212:9: assertion `left == right` failed left: Ok(Span { address: 52164558848, length: 16, direction: DeviceReads }) right: Err(Foreign) note: run with `RUST_BACKTRACE=1` environment variable to display a backtrace failures: device_queue_epoch_and_scope_rejections_preserve_actual_pins test result: FAILED. 0 passed; 1 failed; 0 ignored; 0 measured; 20 filtered out; finished in 0.00s Compiling turkos-os-frame-metadata v0.1.0 (/os-frame-metadata) Compiling turkos-os-dma-memory v0.1.0 (/reports/os-implementation/K781-K799-preparation-zLhH8b/mutant-wrong-queue/os-dma-memory) warning: unused variable: `binding` --> src/dma.rs:406:39 | 406 | fn record(&self, ticket: &Ticket, binding: Binding) -> Result<&Record, Error> { | ^^^^^^^ help: if this is intentional, prefix it with an underscore: `_binding` | = note: `#[warn(unused_variables)]` (part of `#[warn(unused)]`) on by default warning: `turkos-os-dma-memory` (lib) generated 1 warning (run `cargo fix --lib -p turkos-os-dma-memory` to apply 1 suggestion) Finished `test` profile [unoptimized + debuginfo] target(s) in 0.34s Running tests/dma.rs (reports/os-implementation/K781-K799-preparation-zLhH8b/mutant-wrong-queue/target/debug/build/turkos-os-dma-memory/085ed0d7ca9a8439/out/dma-085ed0d7ca9a8439) error: test failed, to rerun pass `--test dma`