running 2 tests test os_vfs_paths_components_positive ... ok test os_vfs_paths_components_negative ... FAILED failures: ---- os_vfs_paths_components_negative stdout ---- thread 'os_vfs_paths_components_negative' (49883947) panicked at /reports/os-implementation/K1545-vfs-paths-local-lkoxl2/mutant/kernel/tests/os/../../../os-vfs-paths/src/lib.rs:57:9: index out of bounds: the len is 16 but the index is 16 note: run with `RUST_BACKTRACE=1` environment variable to display a backtrace failures: os_vfs_paths_components_negative test result: FAILED. 1 passed; 1 failed; 0 ignored; 0 measured; 0 filtered out; finished in 0.00s