running 1 test test os_diagnostics_redaction_negative ... FAILED failures: failures: os_diagnostics_redaction_negative test result: FAILED. 0 passed; 1 failed; 0 ignored; 0 measured; 16 filtered out; finished in 0.00s Compiling turkos-os-runtime-diagnostics v0.1.0 (/reports/os-implementation/K661-K679-llspFW/mutant-private-input/os-runtime-diagnostics) Finished `test` profile [unoptimized + debuginfo] target(s) in 0.28s Running tests/diagnostics.rs (reports/os-implementation/K661-K679-llspFW/mutant-private-input/target/debug/build/turkos-os-runtime-diagnostics/1389b3a65c1f13ac/out/diagnostics-1389b3a65c1f13ac) thread 'os_diagnostics_redaction_negative' (40819849) panicked at tests/diagnostics.rs:368:9: assertion `left == right` failed left: Ok(Record { boot: BootId(1), sequence: 1, service: Diagnostics, data: Event(Ready) }) right: Err(PrivateData) note: run with `RUST_BACKTRACE=1` environment variable to display a backtrace error: test failed, to rerun pass `--test diagnostics`