running 2 tests test os_turkfs_reader_directories_positive ... ok test os_turkfs_reader_directories_negative ... FAILED failures: ---- os_turkfs_reader_directories_negative stdout ---- thread 'os_turkfs_reader_directories_negative' (50254055) panicked at /reports/os-implementation/K1620-turkfs-directory-local-MFxlDp/mutant/kernel/tests/os/turkfs_directory.rs:35:5: assertion `left == right` failed left: Ok(Directory { nodes: [Node { inode: 1, parent: 0, kind: Directory, name_len: 0, name: [0, 0, 0, 0, 0, 0, 0, 0, 0, 0, 0, 0, 0, 0, 0, 0] }, Node { inode: 2, parent: 1, kind: Directory, name_len: 1, name: [97, 0, 0, 0, 0, 0, 0, 0, 0, 0, 0, 0, 0, 0, 0, 0] }, Node { inode: 3, parent: 3, kind: Directory, name_len: 1, name: [98, 0, 0, 0, 0, 0, 0, 0, 0, 0, 0, 0, 0, 0, 0, 0] }, Node { inode: 4, parent: 3, kind: Regular, name_len: 4, name: [102, 105, 108, 101, 0, 0, 0, 0, 0, 0, 0, 0, 0, 0, 0, 0] }] }) right: Err(Loop) note: run with `RUST_BACKTRACE=1` environment variable to display a backtrace failures: os_turkfs_reader_directories_negative test result: FAILED. 1 passed; 1 failed; 0 ignored; 0 measured; 0 filtered out; finished in 0.00s