running 1 test test os_init_reaper_wait_failure_retains_child_for_retry ... FAILED failures: ---- os_init_reaper_wait_failure_retains_child_for_retry stdout ---- thread 'os_init_reaper_wait_failure_retains_child_for_retry' (48095783) panicked at tests/reaper.rs:62:5: assertion `left == right` failed left: (1, 1) right: (0, 0) note: run with `RUST_BACKTRACE=1` environment variable to display a backtrace failures: os_init_reaper_wait_failure_retains_child_for_retry test result: FAILED. 0 passed; 1 failed; 0 ignored; 0 measured; 2 filtered out; finished in 0.00s Compiling turkos-os-init-reaper v0.1.0 (/reports/os-implementation/K1260-reaper-local-preflight-gv3li6/workspace/os-init-reaper) Finished `test` profile [unoptimized + debuginfo] target(s) in 0.13s Running tests/reaper.rs (reports/os-implementation/K1260-reaper-local-preflight-gv3li6/target/debug/build/turkos-os-init-reaper/d9b2fb15fb008589/out/reaper-d9b2fb15fb008589) error: test failed, to rerun pass `--test reaper`