running 1 test test exceptions::tests::stale_generation_does_not_consume_the_live_frame ... FAILED failures: ---- exceptions::tests::stale_generation_does_not_consume_the_live_frame stdout ---- thread 'exceptions::tests::stale_generation_does_not_consume_the_live_frame' (41254258) panicked at src/exceptions.rs:607:9: assertion `left == right` failed left: Ok(()) right: Err(Stale) note: run with `RUST_BACKTRACE=1` environment variable to display a backtrace failures: exceptions::tests::stale_generation_does_not_consume_the_live_frame test result: FAILED. 0 passed; 1 failed; 0 ignored; 0 measured; 2 filtered out; finished in 0.00s Compiling turkos-os-exceptions v0.1.0 (/reports/os-implementation/K901-K919-preparation-EQ5mcc/mutant-stale-token/os-exceptions) Finished `test` profile [unoptimized + debuginfo] target(s) in 0.18s Running unittests src/lib.rs (reports/os-implementation/K901-K919-preparation-EQ5mcc/mutant-stale-token/target/debug/build/turkos-os-exceptions/fc00ebc01b1d547f/out/turkos_os_exceptions-fc00ebc01b1d547f) error: test failed, to rerun pass `--lib`