running 1 test test os_diagnostics_panic_negative ... FAILED failures: failures: os_diagnostics_panic_negative test result: FAILED. 0 passed; 1 failed; 0 ignored; 0 measured; 16 filtered out; finished in 0.00s Compiling turkos-os-runtime-diagnostics v0.1.0 (/reports/os-implementation/K661-K679-llspFW/mutant-fatal-reentry/os-runtime-diagnostics) Finished `test` profile [unoptimized + debuginfo] target(s) in 0.27s Running tests/diagnostics.rs (reports/os-implementation/K661-K679-llspFW/mutant-fatal-reentry/target/debug/build/turkos-os-runtime-diagnostics/1389b3a65c1f13ac/out/diagnostics-1389b3a65c1f13ac) thread 'os_diagnostics_panic_negative' (40820244) panicked at tests/diagnostics.rs:190:5: assertion `left == right` failed left: TransportStalled { bytes: 0, polls: 4096 } right: SilentReentry note: run with `RUST_BACKTRACE=1` environment variable to display a backtrace error: test failed, to rerun pass `--test diagnostics`