running 1 test test os_waitsets_teardown_positive ... FAILED failures: failures: os_waitsets_teardown_positive test result: FAILED. 0 passed; 1 failed; 0 ignored; 0 measured; 2 filtered out; finished in 0.00s thread 'os_waitsets_teardown_positive' (48664295) panicked at /reports/os-implementation/K1360-waitset-teardown-local-preflight-6GPDSi/workspace/kernel/tests/os/waitset_teardown.rs:25:5: assertion `left == right` failed left: [None, Some(Row { id: SubscriptionId(8589934594), object: ObjectKey { kind: Task, id: 12 }, peer_dead: false }), Some(Row { id: SubscriptionId(12884901891), object: ObjectKey { kind: File, id: 13 }, peer_dead: false })] right: [None, None, None] note: run with `RUST_BACKTRACE=1` environment variable to display a backtrace