running 1 test test os_shared_memory_ring_negative ... FAILED failures: failures: os_shared_memory_ring_negative test result: FAILED. 0 passed; 1 failed; 0 ignored; 0 measured; 2 filtered out; finished in 0.00s thread 'os_shared_memory_ring_negative' (48756487) panicked at /reports/os-implementation/K1380-shared-memory-ring-local-preflight-MSpXfz/workspace/kernel/tests/os/shared_memory_ring.rs:30:5: assertion `left == right` failed left: Ok(()) right: Err(Invalid) note: run with `RUST_BACKTRACE=1` environment variable to display a backtrace