running 2 tests test os_pci_resources_bar_size_positive ... ok test os_pci_resources_bar_size_negative ... FAILED failures: ---- os_pci_resources_bar_size_negative stdout ---- thread 'os_pci_resources_bar_size_negative' (49148028) panicked at /reports/os-implementation/K1445-pci-bar-size-local-e0tGw9/mutant/kernel/tests/os/pci_resources.rs:37:5: assertion `left == right` failed left: Ok(MemoryBar { base: 536870912, size: 6144, width: Bits32, prefetchable: false }) right: Err(MalformedMask) note: run with `RUST_BACKTRACE=1` environment variable to display a backtrace failures: os_pci_resources_bar_size_negative test result: FAILED. 1 passed; 1 failed; 0 ignored; 0 measured; 0 filtered out; finished in 0.00s