running 1 test test fatal_irq_reentry_stops_once_then_parks_silently ... FAILED failures: ---- fatal_irq_reentry_stops_once_then_parks_silently stdout ---- thread 'fatal_irq_reentry_stops_once_then_parks_silently' (41254764) panicked at tests/exceptions.rs:532:5: assertion `left == right` failed left: SilentPark right: StopOnce note: run with `RUST_BACKTRACE=1` environment variable to display a backtrace failures: fatal_irq_reentry_stops_once_then_parks_silently test result: FAILED. 0 passed; 1 failed; 0 ignored; 0 measured; 22 filtered out; finished in 0.00s Compiling turkos-os-exceptions v0.1.0 (/reports/os-implementation/K901-K919-preparation-EQ5mcc/mutant-missing-second-fatal/os-exceptions) Finished `test` profile [unoptimized + debuginfo] target(s) in 0.25s Running tests/exceptions.rs (reports/os-implementation/K901-K919-preparation-EQ5mcc/mutant-missing-second-fatal/target/debug/build/turkos-os-exceptions/75414a6222e92fd7/out/exceptions-75414a6222e92fd7) error: test failed, to rerun pass `--test exceptions`