running 1 test test normal_user_rx_and_rw_have_exact_direct_permissions ... FAILED failures: failures: normal_user_rx_and_rw_have_exact_direct_permissions test result: FAILED. 0 passed; 1 failed; 0 ignored; 0 measured; 9 filtered out; finished in 0.00s Compiling turkos-os-runtime-platform v0.1.0 (/os-runtime-platform) Compiling turkos-os-frame-metadata v0.1.0 (/os-frame-metadata) Compiling turkos-os-page-tables v0.1.0 (/reports/os-implementation/K801-K819-bFalcS/mutant-rx-write/os-page-tables) Compiling turkos-os-frame-authority v0.1.0 (/os-frame-authority) Finished `test` profile [unoptimized + debuginfo] target(s) in 0.40s Running tests/descriptor.rs (reports/os-implementation/K801-K819-bFalcS/mutant-rx-write/target/debug/build/turkos-os-page-tables/b64cd06aa99d6d91/out/descriptor-b64cd06aa99d6d91) thread 'normal_user_rx_and_rw_have_exact_direct_permissions' (41099306) panicked at tests/descriptor.rs:146:5: assertion `left == right` failed left: 1 right: 3 note: run with `RUST_BACKTRACE=1` environment variable to display a backtrace error: test failed, to rerun pass `--test descriptor`