running 6 tests test os_block_io_errors_positive ... ok test os_block_io_requests_positive ... ok test os_block_io_timeouts_negative ... ok test os_block_io_timeouts_positive ... ok test os_block_io_errors_negative ... FAILED test os_block_io_requests_negative ... FAILED failures: ---- os_block_io_errors_negative stdout ---- thread 'os_block_io_errors_negative' (49751969) panicked at /reports/os-implementation/K1520-block-errors-local-U7XO5x/mutant/kernel/tests/os/block_io.rs:122:5: assertion `left == right` failed left: Ok(Request { token: Token { head: 0, id: 1, device_generation: 21 }, buffer: 1073745920, lba: 42, deadline: 200, state: Published }) right: Err(ShortRead) note: run with `RUST_BACKTRACE=1` environment variable to display a backtrace ---- os_block_io_requests_negative stdout ---- thread 'os_block_io_requests_negative' (49751971) panicked at /reports/os-implementation/K1520-block-errors-local-U7XO5x/mutant/kernel/tests/os/block_io.rs:46:5: assertion `left == right` failed left: Ok(Request { token: Token { head: 0, id: 1, device_generation: 7 }, buffer: 1073745920, lba: 0, deadline: 200, state: Published }) right: Err(ShortRead) failures: os_block_io_errors_negative os_block_io_requests_negative test result: FAILED. 4 passed; 2 failed; 0 ignored; 0 measured; 0 filtered out; finished in 0.00s