running 1 test test all_sixteen_slots_have_exact_origin_kind_offset_and_base ... FAILED failures: ---- all_sixteen_slots_have_exact_origin_kind_offset_and_base stdout ---- thread 'all_sixteen_slots_have_exact_origin_kind_offset_and_base' (41251807) panicked at tests/exceptions.rs:84:9: assertion `left == right` failed left: CurrentSpx right: CurrentSp0 note: run with `RUST_BACKTRACE=1` environment variable to display a backtrace failures: all_sixteen_slots_have_exact_origin_kind_offset_and_base test result: FAILED. 0 passed; 1 failed; 0 ignored; 0 measured; 22 filtered out; finished in 0.00s Compiling turkos-os-exceptions v0.1.0 (/reports/os-implementation/K901-K919-preparation-EQ5mcc/mutant-slot-origin/os-exceptions) Finished `test` profile [unoptimized + debuginfo] target(s) in 0.27s Running tests/exceptions.rs (reports/os-implementation/K901-K919-preparation-EQ5mcc/mutant-slot-origin/target/debug/build/turkos-os-exceptions/75414a6222e92fd7/out/exceptions-75414a6222e92fd7) error: test failed, to rerun pass `--test exceptions`