running 1 test test mapping::tests::map_generation_exhaustion_precedes_physical_preparation ... FAILED failures: failures: mapping::tests::map_generation_exhaustion_precedes_physical_preparation test result: FAILED. 0 passed; 1 failed; 0 ignored; 0 measured; 3 filtered out; finished in 0.00s Compiling turkos-os-page-tables v0.1.0 (/os-page-tables) Compiling turkos-os-mapping v0.1.0 (/reports/os-implementation/K841-K859-preparation-JcE65w/mutant-map-generation-wrap/os-mapping) Finished `test` profile [unoptimized + debuginfo] target(s) in 0.28s Running unittests src/lib.rs (reports/os-implementation/K841-K859-preparation-JcE65w/mutant-map-generation-wrap/target/debug/build/turkos-os-mapping/8836b47afd18edb1/out/turkos_os_mapping-8836b47afd18edb1) thread 'mapping::tests::map_generation_exhaustion_precedes_physical_preparation' (41134140) panicked at src/mapping.rs:538:9: assertion `left == right` failed left: Ok(()) right: Err(Generation) note: run with `RUST_BACKTRACE=1` environment variable to display a backtrace error: test failed, to rerun pass `--lib`