running 1 test test unmasked_constructor_does_not_touch_hardware ... FAILED failures: failures: unmasked_constructor_does_not_touch_hardware test result: FAILED. 0 passed; 1 failed; 0 ignored; 0 measured; 20 filtered out; finished in 0.00s Compiling turkos-os-clock v0.1.0 (/reports/os-implementation/K941-K959-preparation-T8L8pi/mutant-unmasked-constructor/os-clock) Finished `test` profile [unoptimized + debuginfo] target(s) in 0.30s Running tests/clock.rs (reports/os-implementation/K941-K959-preparation-T8L8pi/mutant-unmasked-constructor/target/debug/build/turkos-os-clock/7e205e95b363aa97/out/clock-7e205e95b363aa97) thread 'unmasked_constructor_does_not_touch_hardware' (41399395) panicked at tests/clock.rs:314:18: unmasked constructor note: run with `RUST_BACKTRACE=1` environment variable to display a backtrace error: test failed, to rerun pass `--test clock`